{"text_format":"1","workbook":"xlsx","n_sheets":5,"sheets":["Reiseregning","Sprak","Validering","Satser","Postnummerregister"],"not_rendered":{"charts":0,"images":2,"macros":1,"external_links":0,"defined_names":2,"comments":0,"pivot_tables":0},"unopened":[],"bounds":{"document_bytes":16777216,"sheet_cells":100000,"rows_first":2000,"rows_last":500,"rows_between":2000,"halvings":0,"cell_chars":16384,"cell_head_chars":4096},"cells_cut":0,"cells_raw":0,"read":"whole","date_system":"1900"}

{"sheet":"Reiseregning","index":0,"n_rows":87,"n_cols":22,"rows_kept":87,"cut":false,"hidden":false,"merged":[[25,13,25,15],[82,1,82,2],[82,3,82,12],[83,1,83,2],[83,3,83,12],[73,1,73,2],[73,3,73,12],[74,1,74,2],[74,3,74,12],[75,1,75,2],[75,3,75,12],[76,1,76,2],[76,3,76,12],[77,1,77,2],[77,3,77,12],[78,1,78,2],[78,3,78,12],[79,1,79,2],[79,3,79,12],[80,1,80,2],[80,3,80,12],[81,1,81,2],[81,3,81,12],[68,13,68,15],[69,13,69,15],[70,13,70,15],[71,13,71,15],[71,11,71,12],[60,13,60,15],[73,13,73,15],[74,13,74,15],[75,13,75,15],[61,3,61,12],[65,3,65,12],[66,13,66,15],[67,13,67,15],[65,13,65,15],[62,13,62,15],[63,13,63,15],[64,13,64,15],[76,13,76,15],[77,13,77,15],[79,13,79,15],[80,13,80,15],[81,13,81,15],[82,13,82,15],[83,13,83,15],[84,13,84,15],[84,11,84,12],[78,13,78,15],[55,13,55,14],[61,1,61,2],[56,1,56,2],[56,3,56,7],[56,8,56,12],[56,13,56,14],[57,13,57,14],[57,4,57,11],[57,1,57,3],[46,1,46,2],[60,1,60,2],[60,3,60,12],[61,13,61,15],[47,13,47,14],[48,1,48,2],[48,3,48,7],[48,8,48,12],[48,13,48,14],[49,1,49,2],[49,3,49,7],[49,8,49,12],[51,8,51,12],[51,13,51,14],[53,13,53,14],[50,1,50,2],[50,3,50,7],[50,8,50,12],[50,13,50,14],[54,1,54,2],[54,3,54,7],[54,8,54,12],[54,13,54,14],[55,1,55,2],[40,1,40,7],[40,9,40,15],[42,9,42,15],[32,1,36,15],[15,11,15,13],[15,14,15,15],[29,3,29,6],[21,13,21,15],[29,10,29,15],[19,1,19,6],[22,13,22,15],[23,13,23,15],[24,13,24,15],[26,13,26,15],[20,13,20,15],[22,10,22,11],[23,10,23,11],[24,10,24,11],[17,11,17,13],[16,14,16,15],[17,14,17,15],[29,7,29,9],[19,10,19,11],[19,13,19,15],[13,3,13,8],[13,12,13,15],[16,3,16,8],[17,4,17,8],[13,9,13,11],[16,9,16,10],[17,9,17,10],[21,1,21,7],[23,1,23,7],[20,1,20,6],[16,11,16,13],[5,3,5,15],[6,12,6,15],[7,11,7,12],[8,3,8,7],[8,11,8,15],[9,4,9,15],[12,4,12,7],[7,13,7,15],[8,8,8,10],[6,5,6,8],[6,9,6,11],[7,9,7,10],[7,3,7,8],[51,1,51,2],[51,3,51,7],[68,1,68,2],[69,1,69,2],[70,1,70,2],[62,3,62,12],[63,3,63,12],[64,3,64,12],[66,3,66,12],[67,3,67,12],[68,3,68,12],[69,3,69,12],[70,3,70,12],[65,1,65,2],[55,3,55,7],[55,8,55,12],[5,21,18,21],[45,11,45,12],[2,12,2,13],[62,1,62,2],[63,1,63,2],[64,1,64,2],[66,1,66,2],[67,1,67,2],[47,1,47,2],[45,13,45,15],[47,3,47,7],[46,3,46,7],[46,8,46,12],[47,8,47,12],[46,13,46,14],[49,13,49,14],[52,1,52,2],[52,3,52,7],[52,8,52,12],[52,13,52,14],[53,1,53,2],[53,3,53,7],[53,8,53,12],[24,1,24,5]]}
[null,null,null,null,null,null,null,null,null,null,null,null,null,null,null,null,null,null,null,null,null,{"$f":"Sprak!H52","v":"VBA (makroer må aktiveres)"}]
[null,{"$f":"Sprak!H2&\" \"&TEXT(Satser!C2,\"d.m.åååå\")&\")\"","v":"Reiseregning for eksterne (fra 1.1.2019)"},null,null,null,null,null,null,null,null,null,null,null,null,null,null,null,null,null,null,null,{"$f":"Sprak!H53","v":"E-post mottaker"}]
[null,"VID vitenskapelige høgskole",null,null,null,null,null,null,null,null,"Language:",null,"Norsk",null,null,null,null,null,{"$f":"SUM(S6:T13)+SUM(S17:U84)","v":10}]
[]
[null,{"$f":"Sprak!H3","v":"Personopplysninger"},null,null,null,null,null,null,null,null,null,null,null,null,null,null,null,null,null,null,null,{"$f":"Sprak!H51","v":"Informasjon"}]
[null,{"$f":"Sprak!H4","v":"Navn"},null,null,null,null,null,null,null,null,null,null,null,null,null,null,null,null,{"$f":"IF(TRIM(D6)=\"\",1,0)","v":1},null,null,{"$f":"Sprak!H50","v":"You can select language in the drop-down that becomes visible when you click in the cell language: \"Norsk\". \n\nFødselsnummer og kontonummer skal kun fylles ut dersom du ikke tidligere er registrert i lønnssystemet. Satsene og beregningene er tatt med for å gi en omtrentlig oversikt over hva som vil bli utbetalt. Det er de satsene og beregningene som ligger i lønnssystemet som vil bli brukt ved utbetalingen av reiseregningen. Utbetalingsbeløpet kan bli mindre pga. forskuddstrekk.\n\nFelter markert med rødt skal fylles ut eller inneholder feil. Husk å legge ved kvitteringer. Skjema sendes til din kontaktperson/oppdragsgiver i VID for anvisning.\n\nSkjemaet kan sendes elektronisk direkte fra Excel dersom du benytter Outlook på din PC. Først må makroer aktiveres. Legg inn adresse til kontaktperson i VID i feltet \"E-post mottaker\". Trykk på \"Send i Outlook\". Dokumentet vil bli kryptert dersom du har fylt ut fødseslsnummer. Du vil bli guidet videre og kan når som helst velge å avbryte prosessen."}]
[null,{"$f":"Sprak!H5","v":"Fødsels /D /Passnr."},null,null,null,null,null,null,null,{"$f":"Sprak!H6","v":"Fødselsdato"},null,null,{"$f":"U7","v":""},null,null,null,null,null,{"$f":"Validering!D1*IF(TRIM(L9)=\"\",1,0)","v":0},{"$f":"IF(TRIM(M7)=\"\",1,0)","v":1},{"$f":"IFERROR(IF(S7=0,DATE(IF(_xlfn.NUMBERVALUE(MID(F7,7,3))<500,19,20)&MID(F7,5,2),MID(F7,3,2),LEFT(F7,2)),\"\"),\"\")","v":""}]
[null,{"$f":"Sprak!H7","v":"Adresse"},null,null,null,null,null,null,null,{"$f":"Sprak!H8","v":"Postnr."},null,null,null,{"$f":"IFERROR(INDEX(tabellPostnummer[Poststed],MATCH(Reiseregning!L8,tabellPostnummer[Postnummer],0)),\"\")","v":""},null,null,null,null,{"$f":"IF(TRIM(D8)=\"\",1,0)","v":1},{"$f":"IF(TRIM(L8)=\"\",1,0)","v":1}]
[null,{"$f":"Sprak!H9","v":"Land"},null,null,null,null,null,null,{"$f":"Sprak!H10","v":"Statsborgerskap"}]
[null,{"$f":"Sprak!H11","v":"E-post lønnsslipp"}]
[]
[null,"Bank"]
[null,{"$f":"Sprak!H12","v":"Kontonummer"},null,null,null,null,null,null,null,null,null,null,null,null,null,null,null,null,{"$f":"Validering!H1","v":0}]
[null,"IBAN",null,null,null,null,null,null,null,"BIC (SWIFT) "]
[]
[null,{"$f":"Sprak!H13","v":"Krav jf. Skattebetalingsforskriften"},null,null,null,null,null,null,null,null,null,{"$f":"Sprak!H18","v":"Dato"},null,null,{"$f":"Sprak!H19","v":"Klokkeslett"}]
[null,{"$f":"Sprak!H14","v":"Formål"},null,null,null,null,null,null,null,{"$f":"Sprak!H16","v":"Avreise"},null,null,null,null,null,null,null,null,{"$f":"IF(TRIM(D17)=\"\",1,0)","v":1},{"$f":"IF(TRIM(L17)=\"\",1,0)","v":1},{"$f":"IF(TRIM(O17)=\"\",1,0)","v":1}]
[null,{"$f":"Sprak!H15","v":"Arrangement/sted"},null,null,null,null,null,null,null,{"$f":"Sprak!H17","v":"Hjemkomst"},null,null,null,null,null,null,null,null,{"$f":"IF(TRIM(E18)=\"\",1,0)","v":1},{"$f":"IF(TRIM(L18)=\"\",1,0)","v":1},{"$f":"IF(TRIM(O18)=\"\",1,0)","v":1}]
[]
[null,{"$f":"Sprak!H20","v":"Sum utlegg og godtgjørelse"},null,null,null,null,null,null,"LA",{"$f":"Sprak!H21","v":"Antall"},{"$f":"Sprak!H22","v":"Sats"},null,null,{"$f":"Sprak!H23","v":"Beløp"}]
[null,{"$f":"Sprak!H24","v":"Overført fra baksiden (side 2)"},null,null,null,null,null,null,"661*",null,null,null,null,{"$f":"N85","v":0}]
[null,{"$f":"Sprak!H25","v":"Kostgodtgjørelse (mat etter regning p. 2)"},null,null,null,null,null,null,668,null,null,null,null,{"$f":"N72","v":0}]
[null,{"$f":"Sprak!H26","v":"Nattillegg, ulegitimert (innland)"},null,null,null,null,null,null,472,null,{"$f":"Satser!D3","v":435},null,null,{"$f":"J23*K23","v":0}]
[null,{"$f":"Sprak!H27","v":"Bil/kjøregodtgjørelse (spesifiser reisen s. 2)"},null,null,null,null,null,null,460,{"$f":"N58","v":0},{"$f":"IFERROR(INDEX(Satser!D7:D10,MATCH(Reiseregning!L46,Satser!B7:B10,0)),INDEX(Satser!D7:D10,MATCH(Reiseregning!L46,Satser!C7:C10,0)))","v":4.4800000000000004},null,null,{"$f":"J24*K24","v":0}]
[null,{"$f":"Sprak!H28","v":"  Passasjertillegg"},null,null,null,null,null,null,464,{"$f":"SUMPRODUCT(N48:N57,P48:P57)","v":0},{"$f":"Satser!D4","v":1},null,null,{"$f":"J25*K25","v":0}]
[null,{"$f":"Sprak!H49","v":"Reiseforskudd"}]
[null,{"$f":"Sprak!H29","v":"Totalsum utlegg og godtgjørelse"},null,null,null,null,null,null,null,null,null,null,null,{"$f":"SUM(N21:P25)-N26","v":0}]
[]
[null,{"$f":"Sprak!H30","v":"Kontering (fylles ut av arbeid-/oppdragsgiver)"}]
[null,{"$f":"Sprak!H31","v":"Arb.plass"},null,null,null,null,null,{"$f":"Sprak!H32","v":"Koststed"}]
[]
[null,{"$f":"Sprak!H33","v":"Merknad"}]
[]
[]
[]
[]
[]
[]
[null,{"$f":"Sprak!H34","v":"Underskrift"}]
[null,{"$f":"Sprak!H35","v":"Arbeid-/oppdragstaker"},null,null,null,null,null,null,null,{"$f":"Sprak!H36","v":"Anviser (budsjettdisponeringsmyndighet)"}]
[]
[null,null,null,null,null,null,null,null,null,{"$f":"Sprak!H37","v":"Attestant (lønnsavdelingen)"}]
[null,{"$f":"TEXT(TODAY(),\"d.m.åååå\") & \"  |  \"&Sprak!H38","v":"3.4.2023  |  s. 1 av 2"}]
[]
[]
[null,{"$f":"Sprak!H39","v":"Reiserute (bil/kjøregodtgjørelse)"},null,null,null,null,null,null,{"$f":"Sprak!H40","v":"Fremkomstmiddel"},null,null,"Bil (inkl El)",null,{"$f":"Sprak!H21","v":"Antall"}]
[null,{"$f":"Sprak!H18","v":"Dato"},null,{"$f":"Sprak!H41","v":"Utgangspunkt"},null,null,null,null,{"$f":"Sprak!H42","v":"Endepunkt"},null,null,null,null,"Km",null,"Passa"]
[null,null,null,null,null,null,null,null,null,null,null,null,null,null,null,null,null,null,{"$f":"IF(TRIM($N48)=\"\",0,IF(TRIM(B48)=\"\",1,0))","v":0},{"$f":"IF(TRIM($N48)=\"\",0,IF(TRIM(D48)=\"\",1,0))","v":0},{"$f":"IF(TRIM($N48)=\"\",0,IF(TRIM(I48)=\"\",1,0))","v":0}]
[null,null,null,null,null,null,null,null,null,null,null,null,null,null,null,null,null,null,{"$f":"IF(TRIM($N49)=\"\",0,IF(TRIM(B49)=\"\",1,0))","v":0},{"$f":"IF(TRIM($N49)=\"\",0,IF(TRIM(D49)=\"\",1,0))","v":0},{"$f":"IF(TRIM($N49)=\"\",0,IF(TRIM(I49)=\"\",1,0))","v":0}]
[null,null,null,null,null,null,null,null,null,null,null,null,null,null,null,null,null,null,0,0,0]
[null,null,null,null,null,null,null,null,null,null,null,null,null,null,null,null,null,null,0,0,0]
[null,null,null,null,null,null,null,null,null,null,null,null,null,null,null,null,null,null,0,0,0]
[null,null,null,null,null,null,null,null,null,null,null,null,null,null,null,null,null,null,0,0,0]
[null,null,null,null,null,null,null,null,null,null,null,null,null,null,null,null,null,null,0,0,0]
[null,null,null,null,null,null,null,null,null,null,null,null,null,null,null,null,null,null,0,0,0]
[null,null,null,null,null,null,null,null,null,null,null,null,null,null,null,null,null,null,0,0,0]
[null,null,null,null,null,null,null,null,null,null,null,null,null,null,null,null,null,null,0,0,0]
[null,{"$f":"Sprak!H43","v":"Navn passasjer(er)"},null,null,null,null,null,null,null,null,null,null,"Sum ",{"$f":"SUM(N48:O57)","v":0},null,null,null,null,{"$f":"IF(AND(SUM(P48:P57)>0,E58=\"\"),1,0)","v":0}]
[]
[null,{"$f":"Sprak!H44","v":"Kostgodtgjørelse (mat etter regning) - husk å legge ved kvitteringer"}]
[null,{"$f":"Sprak!H18","v":"Dato"},null,{"$f":"Sprak!H45","v":"Spesifikasjon"},null,null,null,null,null,null,null,null,null,{"$f":"Sprak!H23","v":"Beløp"}]
[null,null,null,null,null,null,null,null,null,null,null,null,null,null,null,null,null,null,{"$f":"IF(TRIM($N62)=\"\",0,IF(TRIM(B62)=\"\",1,0))","v":0},{"$f":"IF(TRIM($N62)=\"\",0,IF(TRIM(D62)=\"\",1,0))","v":0}]
[null,null,null,null,null,null,null,null,null,null,null,null,null,null,null,null,null,null,{"$f":"IF(TRIM($N63)=\"\",0,IF(TRIM(B63)=\"\",1,0))","v":0},{"$f":"IF(TRIM($N63)=\"\",0,IF(TRIM(D63)=\"\",1,0))","v":0}]
[null,null,null,null,null,null,null,null,null,null,null,null,null,null,null,null,null,null,0,0]
[null,null,null,null,null,null,null,null,null,null,null,null,null,null,null,null,null,null,0,0]
[null,null,null,null,null,null,null,null,null,null,null,null,null,null,null,null,null,null,0,0]
[null,null,null,null,null,null,null,null,null,null,null,null,null,null,null,null,null,null,0,0]
[null,null,null,null,null,null,null,null,null,null,null,null,null,null,null,null,null,null,0,0]
[null,null,null,null,null,null,null,null,null,null,null,null,null,null,null,null,null,null,0,0]
[null,null,null,null,null,null,null,null,null,null,null,null,null,null,null,null,null,null,0,0]
[null,null,null,null,null,null,null,null,null,null,null,null,null,null,null,null,null,null,0,0]
[null,null,null,null,null,null,null,null,null,null,null,"Sum",null,{"$f":"SUM(N62:P71)","v":0}]
[null,{"$f":"Sprak!H47","v":"Utlegg, du må gjerne summere opp utlegg av samme type på en rad"}]
[null,{"$f":"Sprak!H18","v":"Dato"},null,{"$f":"Sprak!H46","v":"Type utlegg"},null,null,null,null,null,null,null,null,null,{"$f":"Sprak!H23","v":"Beløp"}]
[null,null,null,null,null,null,null,null,null,null,null,null,null,null,null,null,null,null,{"$f":"IF(TRIM($N75)=\"\",0,IF(TRIM(B75)=\"\",1,0))","v":0},{"$f":"IF(TRIM($N75)=\"\",0,IF(TRIM(D75)=\"\",1,0))","v":0}]
[null,null,null,null,null,null,null,null,null,null,null,null,null,null,null,null,null,null,{"$f":"IF(TRIM($N76)=\"\",0,IF(TRIM(B76)=\"\",1,0))","v":0},{"$f":"IF(TRIM($N76)=\"\",0,IF(TRIM(D76)=\"\",1,0))","v":0}]
[null,null,null,null,null,null,null,null,null,null,null,null,null,null,null,null,null,null,0,0]
[null,null,null,null,null,null,null,null,null,null,null,null,null,null,null,null,null,null,0,0]
[null,null,null,null,null,null,null,null,null,null,null,null,null,null,null,null,null,null,0,0]
[null,null,null,null,null,null,null,null,null,null,null,null,null,null,null,null,null,null,0,0]
{"$rows_left_out":8}
{"sheet":"Sprak","index":1,"n_rows":53,"n_cols":8,"rows_kept":53,"cut":false,"hidden":true,"merged":[]}
["ID","Norsk","Engelsk",null,"Språk",{"$f":"INDEX(F2:F3,MATCH(Reiseregning!M3,Sprak!E2:E3,0))","v":"B"},null,"Tekst"]
[2,"Reiseregning for eksterne (fra","Travel Expenses for External (from",null,"Norsk","B",null,{"$f":"INDIRECT($F$1&A2)","v":"Reiseregning for eksterne (fra"}]
[3,"Personopplysninger","Personal Information",null,"English","C",null,{"$f":"INDIRECT($F$1&A3)","v":"Personopplysninger"}]
[4,"Navn","Name",null,null,null,null,{"$f":"INDIRECT($F$1&A4)","v":"Navn"}]
[5,"Fødsels /D /Passnr.","D or Passport Number",null,null,null,null,{"$f":"INDIRECT($F$1&A5)","v":"Fødsels /D /Passnr."}]
[6,"Fødselsdato","Date of Birth",null,null,null,null,{"$f":"INDIRECT($F$1&A6)","v":"Fødselsdato"}]
[7,"Adresse","Adress",null,null,null,null,{"$f":"INDIRECT($F$1&A7)","v":"Adresse"}]
[8,"Postnr.","Zip Code",null,null,null,null,{"$f":"INDIRECT($F$1&A8)","v":"Postnr."}]
[9,"Land","Country",null,null,null,null,{"$f":"INDIRECT($F$1&A9)","v":"Land"}]
[10,"Statsborgerskap","Citizenship",null,null,null,null,{"$f":"INDIRECT($F$1&A10)","v":"Statsborgerskap"}]
[11,"E-post lønnsslipp","Email Payslip",null,null,null,null,{"$f":"INDIRECT($F$1&A11)","v":"E-post lønnsslipp"}]
[12,"Kontonummer","Account Number",null,null,null,null,{"$f":"INDIRECT($F$1&A12)","v":"Kontonummer"}]
[13,"Krav jf. Skattebetalingsforskriften","Required cf. Tax Payment Regulations",null,null,null,null,{"$f":"INDIRECT($F$1&A13)","v":"Krav jf. Skattebetalingsforskriften"}]
[14,"Formål","Purpose",null,null,null,null,{"$f":"INDIRECT($F$1&A14)","v":"Formål"}]
[15,"Arrangement/sted","Arrangem./place",null,null,null,null,{"$f":"INDIRECT($F$1&A15)","v":"Arrangement/sted"}]
[16,"Avreise","Departure",null,null,null,null,{"$f":"INDIRECT($F$1&A16)","v":"Avreise"}]
[17,"Hjemkomst","Arrival",null,null,null,null,{"$f":"INDIRECT($F$1&A17)","v":"Hjemkomst"}]
[18,"Dato","Date",null,null,null,null,{"$f":"INDIRECT($F$1&A18)","v":"Dato"}]
[19,"Klokkeslett","Time",null,null,null,null,{"$f":"INDIRECT($F$1&A19)","v":"Klokkeslett"}]
[20,"Sum utlegg og godtgjørelse","Subtotal Expenses and Allowances",null,null,null,null,{"$f":"INDIRECT($F$1&A20)","v":"Sum utlegg og godtgjørelse"}]
[21,"Antall","Qty",null,null,null,null,{"$f":"INDIRECT($F$1&A21)","v":"Antall"}]
[22,"Sats","Rate",null,null,null,null,{"$f":"INDIRECT($F$1&A22)","v":"Sats"}]
[23,"Beløp","Amount",null,null,null,null,{"$f":"INDIRECT($F$1&A23)","v":"Beløp"}]
[24,"Overført fra baksiden (side 2)","Transferred from the Back (page 2)",null,null,null,null,{"$f":"INDIRECT($F$1&A24)","v":"Overført fra baksiden (side 2)"}]
[25,"Kostgodtgjørelse (mat etter regning p. 2)","Food Against Bills (p. 2)",null,null,null,null,{"$f":"INDIRECT($F$1&A25)","v":"Kostgodtgjørelse (mat etter regning p. 2)"}]
[26,"Nattillegg, ulegitimert (innland)","Night Allowance (Inland)",null,null,null,null,{"$f":"INDIRECT($F$1&A26)","v":"Nattillegg, ulegitimert (innland)"}]
[27,"Bil/kjøregodtgjørelse (spesifiser reisen s. 2)","Car/Km Allowance (specify the trip p. 2)",null,null,null,null,{"$f":"INDIRECT($F$1&A27)","v":"Bil/kjøregodtgjørelse (spesifiser reisen s. 2)"}]
[28,"  Passasjertillegg","  Passenger Supplement",null,null,null,null,{"$f":"INDIRECT($F$1&A28)","v":"  Passasjertillegg"}]
[29,"Totalsum utlegg og godtgjørelse","Total Expenses and Allowances",null,null,null,null,{"$f":"INDIRECT($F$1&A29)","v":"Totalsum utlegg og godtgjørelse"}]
[30,"Kontering (fylles ut av arbeid-/oppdragsgiver)","Accounting (to be filled in by employer)",null,null,null,null,{"$f":"INDIRECT($F$1&A30)","v":"Kontering (fylles ut av arbeid-/oppdragsgiver)"}]
[31,"Arb.plass","Workplace",null,null,null,null,{"$f":"INDIRECT($F$1&A31)","v":"Arb.plass"}]
[32,"Koststed","Cost/Project",null,null,null,null,{"$f":"INDIRECT($F$1&A32)","v":"Koststed"}]
[33,"Merknad","Note",null,null,null,null,{"$f":"INDIRECT($F$1&A33)","v":"Merknad"}]
[34,"Underskrift","Signature",null,null,null,null,{"$f":"INDIRECT($F$1&A34)","v":"Underskrift"}]
[35,"Arbeid-/oppdragstaker","Employee/Contractor",null,null,null,null,{"$f":"INDIRECT($F$1&A35)","v":"Arbeid-/oppdragstaker"}]
[36,"Anviser (budsjettdisponeringsmyndighet)","Approver (budget allocation authority)",null,null,null,null,{"$f":"INDIRECT($F$1&A36)","v":"Anviser (budsjettdisponeringsmyndighet)"}]
[37,"Attestant (lønnsavdelingen)","Attestant (payroll department)",null,null,null,null,{"$f":"INDIRECT($F$1&A37)","v":"Attestant (lønnsavdelingen)"}]
[38,"s. 1 av 2","p. 1 of 2",null,null,null,null,{"$f":"INDIRECT($F$1&A38)","v":"s. 1 av 2"}]
[39,"Reiserute (bil/kjøregodtgjørelse)","Itinerary (Car/Km Allowance)",null,null,null,null,{"$f":"INDIRECT($F$1&A39)","v":"Reiserute (bil/kjøregodtgjørelse)"}]
[40,"Fremkomstmiddel","Mode of Transport",null,null,null,null,{"$f":"INDIRECT($F$1&A40)","v":"Fremkomstmiddel"}]
[41,"Utgangspunkt","Starting Point",null,null,null,null,{"$f":"INDIRECT($F$1&A41)","v":"Utgangspunkt"}]
[42,"Endepunkt","End Point",null,null,null,null,{"$f":"INDIRECT($F$1&A42)","v":"Endepunkt"}]
[43,"Navn passasjer(er)","Name Passenger(s)",null,null,null,null,{"$f":"INDIRECT($F$1&A43)","v":"Navn passasjer(er)"}]
[44,"Kostgodtgjørelse (mat etter regning) - husk å legge ved kvitteringer","Food by bill - remember to attach receipts",null,null,null,null,{"$f":"INDIRECT($F$1&A44)","v":"Kostgodtgjørelse (mat etter regning) - husk å legge ved kvitteringer"}]
[45,"Spesifikasjon","Specification",null,null,null,null,{"$f":"INDIRECT($F$1&A45)","v":"Spesifikasjon"}]
[46,"Type utlegg","Type of Outlay",null,null,null,null,{"$f":"INDIRECT($F$1&A46)","v":"Type utlegg"}]
[47,"Utlegg, du må gjerne summere opp utlegg av samme type på en rad","Expenditures, you may summarize outlays of the same type in one row",null,null,null,null,{"$f":"INDIRECT($F$1&A47)","v":"Utlegg, du må gjerne summere opp utlegg av samme type på en rad"}]
[48,"s. 2 av 2","p. 2 of 2",null,null,null,null,{"$f":"INDIRECT($F$1&A48)","v":"s. 2 av 2"}]
[49,"Reiseforskudd","Travel Advance",null,null,null,null,{"$f":"INDIRECT($F$1&A49)","v":"Reiseforskudd"}]
[50,"You can select language in the drop-down that becomes visible when you click in the cell language: \"Norsk\". \n\nFødselsnummer og kontonummer skal kun fylles ut dersom du ikke tidligere er registrert i lønnssystemet. Satsene og beregningene er tatt med for å gi en omtrentlig oversikt over hva som vil bli utbetalt. Det er de satsene og beregningene som ligger i lønnssystemet som vil bli brukt ved utbetalingen av reiseregningen. Utbetalingsbeløpet kan bli mindre pga. forskuddstrekk.\n\nFelter markert med rødt skal fylles ut eller inneholder feil. Husk å legge ved kvitteringer. Skjema sendes til din kontaktperson/oppdragsgiver i VID for anvisning.\n\nSkjemaet kan sendes elektronisk direkte fra Excel dersom du benytter Outlook på din PC. Først må makroer aktiveres. Legg inn adresse til kontaktperson i VID i feltet \"E-post mottaker\". Trykk på \"Send i Outlook\". Dokumentet vil bli kryptert dersom du har fylt ut fødseslsnummer. Du vil bli guidet videre og kan når som helst velge å avbryte prosessen.","The D/Passport number and account number should only be filled in if you are not previously registered in the payroll system. The rates and calculations are included to give an approximate overview of what will be paid. The payment amount may be reduced due to advance payment of tax.\n\nFields marked in red must be filled in or contain errors. Remember to attach receipts. Form is sent to your contact person / client at VID for approval.\n\nThe form can be sent electronically directly from Excel if you use Outlook on your PC. First, macros must be enabled. Enter the address of the contact person at VID in the field \"Email recipient\". Press \"Send i Outlook\". The document will be encrypted if you have entered your D/Passport number. You will be guided further and may choose to cancel the process at any time.\n\nClick \"Attach\" to add i.e. a copy of your passport, then this will also be encrypted.",null,null,null,null,{"$f":"INDIRECT($F$1&A50)","v":"You can select language in the drop-down that becomes visible when you click in the cell language: \"Norsk\". \n\nFødselsnummer og kontonummer skal kun fylles ut dersom du ikke tidligere er registrert i lønnssystemet. Satsene og beregningene er tatt med for å gi en omtrentlig oversikt over hva som vil bli utbetalt. Det er de satsene og beregningene som ligger i lønnssystemet som vil bli brukt ved utbetalingen av reiseregningen. Utbetalingsbeløpet kan bli mindre pga. forskuddstrekk.\n\nFelter markert med rødt skal fylles ut eller inneholder feil. Husk å legge ved kvitteringer. Skjema sendes til din kontaktperson/oppdragsgiver i VID for anvisning.\n\nSkjemaet kan sendes elektronisk direkte fra Excel dersom du benytter Outlook på din PC. Først må makroer aktiveres. Legg inn adresse til kontaktperson i VID i feltet \"E-post mottaker\". Trykk på \"Send i Outlook\". Dokumentet vil bli kryptert dersom du har fylt ut fødseslsnummer. Du vil bli guidet videre og kan når som helst velge å avbryte prosessen."}]
[51,"Informasjon","Information",null,null,null,null,{"$f":"INDIRECT($F$1&A51)","v":"Informasjon"}]
[52,"VBA (makroer må aktiveres)","VBA (macros must be enabled)",null,null,null,null,{"$f":"INDIRECT($F$1&A52)","v":"VBA (makroer må aktiveres)"}]
[53,"E-post mottaker","Email recipient",null,null,null,null,{"$f":"INDIRECT($F$1&A53)","v":"E-post mottaker"}]

{"sheet":"Validering","index":2,"n_rows":22,"n_cols":8,"rows_kept":22,"cut":false,"hidden":true,"merged":[]}
["Fødselsnummer",null,{"$f":"TEXT(Reiseregning!F7,\"00000000000\")","v":"00000000000"},{"$f":"IF(SUM(D17:D22)=3,0,1)","v":0},null,"Kontoummer",{"$f":"TEXT(Reiseregning!E13,\"00000000000\")","v":"00000000000"},{"$f":"IF(SUM(H17:H19)=2,0,1)","v":0}]
[]
["d1",1,{"$f":"MID($C$1,B3,1)","v":"0"},null,null,"x1",{"$f":"MID($G$1,B3,1)","v":"0"}]
["d2",2,{"$f":"MID($C$1,B4,1)","v":"0"},null,null,"x2",{"$f":"MID($G$1,B4,1)","v":"0"}]
["m1",3,"0",null,null,"x3","0"]
["m2",4,"0",null,null,"x4","0"]
["a1",5,"0",null,null,"y1","0"]
["a2",6,"0",null,null,"y2","0"]
["i1",7,"0",null,null,"z1","0"]
["i2",8,"0",null,null,"z2","0"]
["i3",9,"0",null,null,"z3","0"]
["k1",10,"0",null,null,"z4","0"]
["k2",11,"0",null,null,"c","0"]
[]
[]
["k1",null,{"$f":"11-((3*C3+7*C4+6*C5+1*C6+8*C7+9*C8+4*C9+5*C10+2*C11))","v":11},null,null,"c",{"$f":"11-((5*G3+4*G4+3*G5+2*G6+7*G7+6*G8+5*G9+4*G10+3*G11+2*G12))","v":11}]
[null,null,{"$f":"C16-INT(C16/11)*11","v":0},{"$f":"DELTA(C12,C17)","v":1},null,null,{"$f":"G16-INT(G16/11)*11","v":0},{"$f":"DELTA(G13,G17)","v":1}]
[]
["k2",null,{"$f":"11-((5*C3+4*C4+3*C5+2*C6+7*C7+6*C8+5*C9+4*C10+3*C11+2*C17))","v":11},null,null,"Lengde",{"$f":"LEN(G1)","v":11},{"$f":"IF(G19=11,1,0)","v":1}]
[null,null,{"$f":"C19-INT(C19/11)*11","v":0},{"$f":"DELTA(C13,C20)","v":1}]
[]
["Lengde",null,{"$f":"LEN(C1)","v":11},{"$f":"IF(C22=11,1,0)","v":1}]

{"sheet":"Satser","index":3,"n_rows":10,"n_cols":5,"rows_kept":10,"cut":false,"hidden":false,"merged":[]}
[]
[null,"pr. dato","2019-01-01"]
[null,"Nattillegg",null,435]
[null,"Passasjertillegg",null,1]
[]
[null,"Norsk","Engelsk","Sats","Fremkomstmidler"]
[7,"Bil (inkl El)","Car (incl. El)",4.4800000000000004,{"$f":"INDIRECT(Sprak!$F$1&A7)","v":"Bil (inkl El)"}]
[8,"Motorsykkel","Motorcycle",2.95,{"$f":"INDIRECT(Sprak!$F$1&A8)","v":"Motorsykkel"}]
[9,"Moped <126","Moped <126",2,{"$f":"INDIRECT(Sprak!$F$1&A9)","v":"Moped <126"}]
[10,"Tromsø","Tromsø",4.13,{"$f":"INDIRECT(Sprak!$F$1&A10)","v":"Tromsø"}]

{"sheet":"Postnummerregister","index":4,"n_rows":5094,"n_cols":2,"rows_kept":5094,"cut":false,"hidden":true,"merged":[]}
["Postnummer","Poststed"]
[1,"OSLO"]
[10,"OSLO"]
[15,"OSLO"]
[18,"OSLO"]
[21,"OSLO"]
[24,"OSLO"]
[26,"OSLO"]
[28,"OSLO"]
[30,"OSLO"]
[31,"OSLO"]
[32,"OSLO"]
[33,"OSLO"]
[34,"OSLO"]
[37,"OSLO"]
[40,"OSLO"]
[45,"OSLO"]
[46,"OSLO"]
[47,"OSLO"]
[48,"OSLO"]
[50,"OSLO"]
[55,"OSLO"]
[60,"OSLO"]
[81,"OSLO"]
[101,"OSLO"]
[102,"OSLO"]
[103,"OSLO"]
[104,"OSLO"]
[105,"OSLO"]
[106,"OSLO"]
[107,"OSLO"]
[109,"OSLO"]
[110,"OSLO"]
[111,"OSLO"]
[112,"OSLO"]
[113,"OSLO"]
[114,"OSLO"]
[115,"OSLO"]
[116,"OSLO"]
[117,"OSLO"]
[118,"OSLO"]
[119,"OSLO"]
[120,"OSLO"]
[121,"OSLO"]
[122,"OSLO"]
[123,"OSLO"]
[124,"OSLO"]
[125,"OSLO"]
[128,"OSLO"]
[129,"OSLO"]
[130,"OSLO"]
[131,"OSLO"]
[132,"OSLO"]
[133,"OSLO"]
[134,"OSLO"]
[135,"OSLO"]
[136,"OSLO"]
[138,"OSLO"]
[139,"OSLO"]
[140,"OSLO"]
[150,"OSLO"]
[151,"OSLO"]
[152,"OSLO"]
[153,"OSLO"]
[154,"OSLO"]
[155,"OSLO"]
[157,"OSLO"]
[158,"OSLO"]
[159,"OSLO"]
[160,"OSLO"]
[161,"OSLO"]
[162,"OSLO"]
[164,"OSLO"]
[165,"OSLO"]
[166,"OSLO"]
[167,"OSLO"]
[168,"OSLO"]
[169,"OSLO"]
[170,"OSLO"]
[171,"OSLO"]
{"$rows_left_out":5014}